- Failed to apply plugin [id ‘com.android.internal.application’] — Android studio — Troubleshooting
- Problem
- Solution
- Conclusion
- Android Studio 4.1 Development Essentials — Kotlin Edition: Developing Android 11 Apps Using Android Studio 4.1, Kotlin and Android Jetpack (English Edition)
- See the offer
- Failed to apply plugin [id ‘com.android.library’] #3618
- Comments
- MirandaHinojosa commented Sep 26, 2018
- Ошибка Gradle в Android Studio: плагин с id ‘ com.андроид.библиотека не найден
- 4 ответов
- Невозможно загрузить библиотеку Android на JitPack.io. Не удалось применить плагин [id ‘com.android.internal.version-check’]
- 2 ответа
- Android Studio: плагин с идентификатором «android-библиотека» не найден
- 6 ответов:
Failed to apply plugin [id ‘com.android.internal.application’] — Android studio — Troubleshooting
This troubleshooting resolves the error Failed to apply plugin [id ‘com.android.internal.application’] in android studio.
We encountered a compilation error after a big update to the gradle tool. In this tutorial dedicated to troubleshooting computer errors we will try to provide the solution that worked (for us anyway) !!
Problem
While compiling your android application you find the error below:
If this is your case, the help would be much simpler than it seems.
Solution
To solve this problem just remove the script line below from the file gradle.properties
The file gradle.properties is at the root of your project. It is difficult to miss it.
Conclusion
Android Studio 4.1 Development Essentials — Kotlin Edition: Developing Android 11 Apps Using Android Studio 4.1, Kotlin and Android Jetpack (English Edition)
Completely updated for Android Studio 4.1, the goal of this book is to teach the skills necessary to develop Android-based applications using the Kotlin programming language.
Starting with the basics, this book provides an overview of the steps required to set up an Android development and testing environment, followed by an introduction to programming in Kotlin, including data types, flow control, functions. , lambdas and object oriented programming.
An overview of Android Studio is included, covering areas such as tool windows, the code editor, and the Layout Editor tool. An introduction to the architecture of Android is followed by an in-depth review of the design of Android applications and user interfaces using the Android Studio environment.
See the offer
- Do you have any stories to tell us? Go to the page Guest post to find out how to do it.
To advertise on TediDev, see the page advertising and sponsors
Источник
Failed to apply plugin [id ‘com.android.library’] #3618
Comments
MirandaHinojosa commented Sep 26, 2018
lint finished in 6.19 s
cordova run android
Android Studio project detected
ANDROID_HOME=C:\Users\Miranda\AppData\Local\Android\android-sdk
JAVA_HOME=C:\Program Files\java\jdk1.8.0_181
studio
Subproject Path: CordovaLib
Subproject Path: app
FAILURE: Build failed with an exception.
Where:
Build file ‘C:\Users\Miranda\Donaci�n\Blood\platforms\android\CordovaLib\build.gradle’ line: 42
What went wrong:
A problem occurred evaluating project ‘:CordovaLib’.
Failed to apply plugin [id ‘com.android.library’]
Your project path contains non-ASCII characters. This will most likely cause the build to fail on Windows. Please move your project to a different directory. See http://b.android.com/95744 for details. This warning can be disabled by adding the line ‘android.overridePathCheck=true’ to gradle.properties file in the project directory.
Try:
Run with —stacktrace option to get the stack trace. Run with —info or —debug option to get more log output.
BUILD FAILED in 3s
(node:4504) UnhandledPromiseRejectionWarning: Error: cmd: Command failed with exit code 1 Error output:
FAILURE: Build failed with an exception.
Where:
Build file ‘C:\Users\Miranda\Donaci�n\Blood\platforms\android\CordovaLib\build.gradle’ line: 42
What went wrong:
A problem occurred evaluating project ‘:CordovaLib’.
Failed to apply plugin [id ‘com.android.library’]
Your project path contains non-ASCII characters. This will most likely cause the build to fail on Windows. Please move your project to a different directory. See http://b.android.com/95744 for details. This warning can be disabled by adding the line ‘android.overridePathCheck=true’ to gradle.properties file in the project directory.
Try:
Run with —stacktrace option to get the stack trace. Run with —info or —debug option to get more log output.
BUILD FAILED in 3s
at ChildProcess.whenDone (C:\Users\Miranda\Donación\Blood\platforms\android\cordova\node_modules\cordova-common\src\superspawn.js:169:23)
at emitTwo (events.js:126:13)
at ChildProcess.emit (events.js:214:7)
at maybeClose (internal/child_process.js:925:16)
at Process.ChildProcess._handle.onexit (internal/child_process.js:209:5)
(node:4504) UnhandledPromiseRejectionWarning: Unhandled promise rejection. This error originated either by throwing inside of an async function without a catch block, or by rejecting a promise which was not handled with .catch(). (rejection id: 1)
(node:4504) [DEP0018] DeprecationWarning: Unhandled promise rejections are deprecated. In the future, promise rejections that are not handled will terminate the Node.js process with a non-zero exit code.
The text was updated successfully, but these errors were encountered:
Источник
Ошибка Gradle в Android Studio: плагин с id ‘ com.андроид.библиотека не найден
когда я пытаюсь построить проект библиотеки Android в Android Studio, я получаю следующую ошибку Gradle:
Я довольно новичок в Gradle и это очень запутанной для меня. Почему это происходит?
сборка.файл Gradle выглядит следующим образом:
4 ответов
ваша проблема в том, что вы используете файл верхнего уровня где вы не можете использовать такой плагин.
— вы примерно следующую структуру:
на ваш топ-уровня файл, который вы можете использовать:
в своем lib/build.gradle вы можете использовать код выложил в вопрос:
наконец-то в свой settings.gradle
также вы можете обратиться этот вопрос.
предполагая, что у вас есть стандартная структура проекта, как показано ниже:
ваш сбой синхронизации, похоже, указывает на проблему с вашей конфигурацией SDK/IDE.
начните с открытия диалогового окна » структура проекта «и убедитесь, что значение» Android SDK location: «установлено на правильный путь.
во-вторых, откройте Диспетчер SDK и снова убедитесь, что у вас установлен правильный путь к местоположению SDK.
в-третьих, убедитесь, что у вас есть правильная версия установлен пакет» Android SDK Build-Tools». (23.0.2 в данном случае)
наконец, чтобы убедиться, что у нас нет плохого состояния, я рекомендую сделать «Invalidate и Restart» из файла -> «Invalidate Caches /Restart. «
после всего этого я ожидаю, что он должен синхронизировать. Если не попытаться запустить ./gradlew из корня вашего проекта и сообщать нам о любой новой информации.
добавьте эти строки в файл gradle библиотеки.
Источник
Невозможно загрузить библиотеку Android на JitPack.io. Не удалось применить плагин [id ‘com.android.internal.version-check’]
Я сделал библиотеку для Android и загрузил ее на Github. (https://github.com/Shekhar23/TxtLogSdk)
Теперь хочу добавить на jitpack.io. Но получаю ошибку!
Как я могу загрузить на jitpack.io?
Возникла проблема при оценке проекта «: приложение».
Не удалось применить плагин [id ‘com.android.internal.version-check’] Минимальная поддерживаемая версия Gradle — 6.1.1. Текущая версия — 4.8.1. При использовании оболочки gradle попробуйте отредактировать distributionUrl в /home/jitpack/build/gradle/wrapper/gradle-wrapper.properties на gradle-6.1.1-all.zip
2 ответа
Первоначально у меня также была эта ошибка с Gradle 4.8.1 , которая наверняка сбивала с толку:
См. build.log для подробностей.
На самом деле я пропустил включение ./gradlew и ./gradle/wrapper/gradle-wrapper.jar в репозиторий git. Да! Вам следует загрузить эти файлы на github!
После этого вы можете использовать последнюю версию Gradle, и это здорово! Вот журнал сборки:
См. build.log для подробностей.
- Фактически эта информация находится в официальном руководстве https://jitpack.io/docs/ANDROID/, но требования к загрузке файлов gradle не совсем понятны.
- Комментарий к этой проблеме был очень полезным: https://github.com/jitpack/jitpack. io / issues / 2311
P.S. Плагин com.github.dcendents.android-maven должен быть включен в два build.gradle — файла, как описано в руководстве.
Вы обновляли файлы Gradle?
У вас должно получиться что-то похожее на конфигурацию ниже:
Источник
Android Studio: плагин с идентификатором «android-библиотека» не найден
Я пытался заставить ActionBarSherlock работать и иметь некоторые проблемы. Одна проблема я столкнулся следующее сообщение при попытке построить его:
Я рассматриваю это как проблему ABS в отдельном потоке, поэтому здесь мне любопытно, как решить общую проблему:
вот сборка.Gradle в:
вы можете помочь?
6 ответов:
поручите Gradle загрузить плагин для Android из центрального репозитория Maven.
вы делаете это, вставляя следующий код в начале файла сборки Gradle:
заменить версии, строку 1.0.+ С последней версией. Выпущенные версии плагина Gradle можно найти в официальный репозиторий Maven или MVNRepository артефакт поиск.
просто для записи (заняло у меня довольно много времени), прежде чем ответ Гжегожа сработал для меня, я должен был установить «репозиторий поддержки android» через менеджер SDK!
установите его и добавьте следующий код выше применить плагин: ‘android-библиотека’ в сборке.gradle из папки actionbarsherlock!
для преобразования модуля приложения в модуль библиотеки. Более подробная информация здесь:https://developer.android.com/studio/projects/android-library.html
использовать mavenCentral() или jcenter() добавить в сценарий:
в более поздних версиях плагин изменил имя на:
и, как уже упоминалось в некоторых других ответах, вам нужны инструменты gradle, чтобы использовать его. Используя 3.0.1, вы должны использовать РЕПО google, а не mavenCentral или jcenter:
добавить ниже к build.gradle модуль проекта:
/ / файл сборки верхнего уровня, в котором можно добавить параметры конфигурации, общие для всех подпроектов/модулей.
Источник